TestDisk 6.11

Wawrzyniec Niewodniczański wawrzek at gmail.com
Fri Jan 1 19:49:21 UTC 2010


Hi,

I've tried to build latest TestDisk  - 6.11 and I got following error:

make[2]: Entering directory `/usr/ports/others/testdisk/testdisk-6.11/src'
gcc  -g -O2 -Wdeclaration-after-statement -Wall -MD -Wpointer-arith
-Wmissing-declarations -Wmissing-prototypes -Wstrict-prototypes
-Wshadow -Wwrite-strings -W -Wcast-align -Waggregate-return
-Wbad-function-cast -Wcast-qual -Wundef -Wredundant-decls
-Wsign-compare -Wnested-externs -Winline -Wdisabled-optimization
-Wfloat-equal -Wmissing-format-attribute -Wmultichar   -o testdisk
common.o crc.o ewf.o fnctdsk.o hdaccess.o hdcache.o hdwin32.o hidden.o
hpa_dco.o intrf.o log.o log_part.o misc.o msdos.o parti386.o partgpt.o
partmac.o partsun.o partnone.o partxbox.o io_redir.o ntfs_io.o
ntfs_utl.o partauto.o sudo.o unicode.o win32.o  analyse.o bfs.o bsd.o
cramfs.o exfat.o fat.o fatx.o ext2.o jfs.o hfs.o hfsp.o hpfs.o luks.o
lvm.o md.o netware.o ntfs.o rfs.o savehdr.o sun.o swap.o sysv.o ufs.o
xfs.o  addpart.o adv.o askloc.o chgtype.o chgtypen.o dimage.o dirn.o
dirpart.o diskacc.o diskcapa.o edit.o ext2_sb.o ext2_sbn.o fat1x.o
fat32.o fat_adv.o fat_cluster.o fatn.o geometry.o godmode.o hiddenn.o
intrface.o intrfn.o nodisk.o ntfs_adv.o ntfs_fix.o ntfs_udl.o
parti386n.o partgptn.o partmacn.o partsunn.o partxboxn.o tanalyse.o
tbanner.o tdelete.o tdiskop.o tdisksel.o testdisk.o thfs.o tload.o
tlog.o tmbrcode.o tntfs.o toptions.o tpartwr.o  dir.o ext2_dir.o
fat_dir.o ntfs_dir.o rfs_dir.o  next.o -lncursesw -lz -luuid -lcrypto
-lext2fs -lcom_err
ext2_dir.o: In function `ext2_copy':
/usr/ports/others/testdisk/testdisk-6.11/src/ext2_dir.c:308: undefined
reference to `ext2fs_file_open'
/usr/ports/others/testdisk/testdisk-6.11/src/ext2_dir.c:318: undefined
reference to `ext2fs_file_read'
/usr/ports/others/testdisk/testdisk-6.11/src/ext2_dir.c:333: undefined
reference to `ext2fs_file_close'
collect2: ld returned 1 exit status
make[2]: *** [testdisk] Error 1
make[2]: Leaving directory `/usr/ports/others/testdisk/testdisk-6.11/src'
make[1]: *** [all-recursive] Error 1
make[1]: Leaving directory `/usr/ports/others/testdisk/testdisk-6.11'
make: *** [all] Error 2

I will appreciate any suggestion. Oh, I'm using
# crux
CRUX version 2.6

Wawrzek
-- 
 Wawrzyniec Niewodniczański      vel Wawrzek Larry or LarryN
    Linux User #177124              E-MAIL: wawrzek at gmail.com
 PhD in Quantum Chemistry            WWW: http://wawrzek.name
 MSc in Molecular Engineering           JID: wawrzek at jabber.wroc.pl



More information about the CRUX mailing list